{"text_format":"1","workbook":"xlsx","n_sheets":7,"sheets":["Guidelines","Menu","Emp_Master","Data_Entry","Repo_Emp","Repo_Zone","Repo_Sum"],"not_rendered":{"charts":0,"images":0,"macros":1,"external_links":0,"defined_names":5,"comments":0,"pivot_tables":2},"unopened":[],"bounds":{"document_bytes":16777216,"sheet_cells":100000,"rows_first":2000,"rows_last":500,"rows_between":2000,"halvings":0,"cell_chars":16384,"cell_head_chars":4096},"cells_cut":0,"cells_raw":0,"read":"whole","date_system":"1900"}

{"sheet":"Guidelines","index":0,"n_rows":14,"n_cols":12,"rows_kept":14,"cut":false,"hidden":false,"merged":[[9,2,9,15],[1,1,1,15],[2,2,2,15],[4,2,4,15],[6,2,6,15],[8,2,8,15]]}
[]
[null,"Guide Lines - How to track Franchise Agreement utilisation Status"]
[null,"Step-->1","Click to go  Menu"]
[]
[null,"Step-->2","Go to Employee_Master sheet. At first create employee master data (basic info of business development team only,who are using the franchise agreement). Put Employee code, Employee Zone, Employee Location. Put your organistion name in cell B1"]
[]
[null,"Step-->3","Go to Data Entry sheet. Select Employee Code from drop down list. Put only data in cells marked with Green color"]
[]
[null,"Step-->4","To get report go to -Generate Report. Select the desired Report Employee wise/ Zone wise/ Summary. From drop down list get the report accordingly. Select only One Field at a time in respetive Report marked in Green color"]
[null,null,"Note: Click \"Refresh\" button in respective report sheet to reflect updated report ."]
[]
[]
[]
[null,null,null,null,null,null,null,null,null,null,null,"For any query write to : p_das2001@rediffmail.com"]

{"sheet":"Menu","index":1,"n_rows":22,"n_cols":5,"rows_kept":22,"cut":false,"hidden":false,"merged":[[18,4,18,6],[2,3,3,6],[5,3,6,6],[8,3,9,6],[11,3,12,6],[14,4,14,6],[16,4,16,6]]}
[null,null,{"$f":"Emp_Master!B1","v":0}]
[]
[null,null,null,"Menu"]
[]
[null,null,null,"Select the option"]
[null,null,null,"Employee Master"]
[]
[]
[null,null,null,"Data Entry"]
[]
[]
[null,null,null,"Generate Report"]
[]
[]
[null,null,null,null,"Employee wise Report"]
[]
[null,null,null,null,"Zone wise Report"]
[]
[null,null,null,null,"Summary Report"]
[]
[]
[null,null,null,"For any querry write to : prodipdas08@gmail.com"]

{"sheet":"Emp_Master","index":2,"n_rows":3,"n_cols":6,"rows_kept":3,"cut":false,"hidden":true,"merged":[]}
["Name of Co."]
[]
["Emp_Code","Employee Name","Zone","Location","Email ID","Mobile No"]

{"sheet":"Data_Entry","index":3,"n_rows":1000,"n_cols":14,"rows_kept":1000,"cut":false,"hidden":true,"merged":[]}
[null,"Co. Name:",{"$f":"Emp_Master!B1","v":0}]
[]
[null,"Emp_Code","Employee Name","Zone","Location","Email ID","Mobile No","Franchise Agr. Sr. No.","Issue Dt","Signed by Prospect ( Y / N)","Name of Prospect","Agreement Signed Dt.","Proposed Location","Business Model"]
[null,null,{"$f":"VLOOKUP(B4,Emp_Master!$A$4:$F$500,2)","v":{"$error":"#N/A"}},{"$f":"VLOOKUP(B4,Emp_Master!$A$4:$F$500,3)","v":{"$error":"#N/A"}},{"$f":"VLOOKUP(B4,Emp_Master!$A$4:$F$500,4)","v":{"$error":"#N/A"}},{"$f":"VLOOKUP(B4,Emp_Master!$A$4:$F$500,5)","v":{"$error":"#N/A"}},{"$f":"VLOOKUP(B4,Emp_Master!$A$4:$F$500,6)","v":{"$error":"#N/A"}}]
[null,null,{"$f":"VLOOKUP(B5,Emp_Master!$A$4:$F$500,2)","v":{"$error":"#N/A"}},{"$f":"VLOOKUP(B5,Emp_Master!$A$4:$F$500,3)","v":{"$error":"#N/A"}},{"$f":"VLOOKUP(B5,Emp_Master!$A$4:$F$500,4)","v":{"$error":"#N/A"}},{"$f":"VLOOKUP(B5,Emp_Master!$A$4:$F$500,5)","v":{"$error":"#N/A"}},{"$f":"VLOOKUP(B5,Emp_Master!$A$4:$F$500,6)","v":{"$error":"#N/A"}}]
[null,null,{"$f":"VLOOKUP(B6,Emp_Master!$A$4:$F$500,2)","v":{"$error":"#N/A"}},{"$f":"VLOOKUP(B6,Emp_Master!$A$4:$F$500,3)","v":{"$error":"#N/A"}},{"$f":"VLOOKUP(B6,Emp_Master!$A$4:$F$500,4)","v":{"$error":"#N/A"}},{"$f":"VLOOKUP(B6,Emp_Master!$A$4:$F$500,5)","v":{"$error":"#N/A"}},{"$f":"VLOOKUP(B6,Emp_Master!$A$4:$F$500,6)","v":{"$error":"#N/A"}}]
[null,null,{"$f":"VLOOKUP(B7,Emp_Master!$A$4:$F$500,2)","v":{"$error":"#N/A"}},{"$f":"VLOOKUP(B7,Emp_Master!$A$4:$F$500,3)","v":{"$error":"#N/A"}},{"$f":"VLOOKUP(B7,Emp_Master!$A$4:$F$500,4)","v":{"$error":"#N/A"}},{"$f":"VLOOKUP(B7,Emp_Master!$A$4:$F$500,5)","v":{"$error":"#N/A"}},{"$f":"VLOOKUP(B7,Emp_Master!$A$4:$F$500,6)","v":{"$error":"#N/A"}}]
[null,null,{"$f":"VLOOKUP(B8,Emp_Master!$A$4:$F$500,2)","v":{"$error":"#N/A"}},{"$f":"VLOOKUP(B8,Emp_Master!$A$4:$F$500,3)","v":{"$error":"#N/A"}},{"$f":"VLOOKUP(B8,Emp_Master!$A$4:$F$500,4)","v":{"$error":"#N/A"}},{"$f":"VLOOKUP(B8,Emp_Master!$A$4:$F$500,5)","v":{"$error":"#N/A"}},{"$f":"VLOOKUP(B8,Emp_Master!$A$4:$F$500,6)","v":{"$error":"#N/A"}}]
[null,null,{"$f":"VLOOKUP(B9,Emp_Master!$A$4:$F$500,2)","v":{"$error":"#N/A"}},{"$f":"VLOOKUP(B9,Emp_Master!$A$4:$F$500,3)","v":{"$error":"#N/A"}},{"$f":"VLOOKUP(B9,Emp_Master!$A$4:$F$500,4)","v":{"$error":"#N/A"}},{"$f":"VLOOKUP(B9,Emp_Master!$A$4:$F$500,5)","v":{"$error":"#N/A"}},{"$f":"VLOOKUP(B9,Emp_Master!$A$4:$F$500,6)","v":{"$error":"#N/A"}}]
[null,null,{"$f":"VLOOKUP(B10,Emp_Master!$A$4:$F$500,2)","v":{"$error":"#N/A"}},{"$f":"VLOOKUP(B10,Emp_Master!$A$4:$F$500,3)","v":{"$error":"#N/A"}},{"$f":"VLOOKUP(B10,Emp_Master!$A$4:$F$500,4)","v":{"$error":"#N/A"}},{"$f":"VLOOKUP(B10,Emp_Master!$A$4:$F$500,5)","v":{"$error":"#N/A"}},{"$f":"VLOOKUP(B10,Emp_Master!$A$4:$F$500,6)","v":{"$error":"#N/A"}}]
[null,null,{"$f":"VLOOKUP(B11,Emp_Master!$A$4:$F$500,2)","v":{"$error":"#N/A"}},{"$f":"VLOOKUP(B11,Emp_Master!$A$4:$F$500,3)","v":{"$error":"#N/A"}},{"$f":"VLOOKUP(B11,Emp_Master!$A$4:$F$500,4)","v":{"$error":"#N/A"}},{"$f":"VLOOKUP(B11,Emp_Master!$A$4:$F$500,5)","v":{"$error":"#N/A"}},{"$f":"VLOOKUP(B11,Emp_Master!$A$4:$F$500,6)","v":{"$error":"#N/A"}}]
[null,null,{"$f":"VLOOKUP(B12,Emp_Master!$A$4:$F$500,2)","v":{"$error":"#N/A"}},{"$f":"VLOOKUP(B12,Emp_Master!$A$4:$F$500,3)","v":{"$error":"#N/A"}},{"$f":"VLOOKUP(B12,Emp_Master!$A$4:$F$500,4)","v":{"$error":"#N/A"}},{"$f":"VLOOKUP(B12,Emp_Master!$A$4:$F$500,5)","v":{"$error":"#N/A"}},{"$f":"VLOOKUP(B12,Emp_Master!$A$4:$F$500,6)","v":{"$error":"#N/A"}}]
[null,null,{"$f":"VLOOKUP(B13,Emp_Master!$A$4:$F$500,2)","v":{"$error":"#N/A"}},{"$f":"VLOOKUP(B13,Emp_Master!$A$4:$F$500,3)","v":{"$error":"#N/A"}},{"$f":"VLOOKUP(B13,Emp_Master!$A$4:$F$500,4)","v":{"$error":"#N/A"}},{"$f":"VLOOKUP(B13,Emp_Master!$A$4:$F$500,5)","v":{"$error":"#N/A"}},{"$f":"VLOOKUP(B13,Emp_Master!$A$4:$F$500,6)","v":{"$error":"#N/A"}}]
[null,null,{"$f":"VLOOKUP(B14,Emp_Master!$A$4:$F$500,2)","v":{"$error":"#N/A"}},{"$f":"VLOOKUP(B14,Emp_Master!$A$4:$F$500,3)","v":{"$error":"#N/A"}},{"$f":"VLOOKUP(B14,Emp_Master!$A$4:$F$500,4)","v":{"$error":"#N/A"}},{"$f":"VLOOKUP(B14,Emp_Master!$A$4:$F$500,5)","v":{"$error":"#N/A"}},{"$f":"VLOOKUP(B14,Emp_Master!$A$4:$F$500,6)","v":{"$error":"#N/A"}}]
[null,null,{"$f":"VLOOKUP(B15,Emp_Master!$A$4:$F$500,2)","v":{"$error":"#N/A"}},{"$f":"VLOOKUP(B15,Emp_Master!$A$4:$F$500,3)","v":{"$error":"#N/A"}},{"$f":"VLOOKUP(B15,Emp_Master!$A$4:$F$500,4)","v":{"$error":"#N/A"}},{"$f":"VLOOKUP(B15,Emp_Master!$A$4:$F$500,5)","v":{"$error":"#N/A"}},{"$f":"VLOOKUP(B15,Emp_Master!$A$4:$F$500,6)","v":{"$error":"#N/A"}}]
[null,null,{"$f":"VLOOKUP(B16,Emp_Master!$A$4:$F$500,2)","v":{"$error":"#N/A"}},{"$f":"VLOOKUP(B16,Emp_Master!$A$4:$F$500,3)","v":{"$error":"#N/A"}},{"$f":"VLOOKUP(B16,Emp_Master!$A$4:$F$500,4)","v":{"$error":"#N/A"}},{"$f":"VLOOKUP(B16,Emp_Master!$A$4:$F$500,5)","v":{"$error":"#N/A"}},{"$f":"VLOOKUP(B16,Emp_Master!$A$4:$F$500,6)","v":{"$error":"#N/A"}}]
[null,null,{"$f":"VLOOKUP(B17,Emp_Master!$A$4:$F$500,2)","v":{"$error":"#N/A"}},{"$f":"VLOOKUP(B17,Emp_Master!$A$4:$F$500,3)","v":{"$error":"#N/A"}},{"$f":"VLOOKUP(B17,Emp_Master!$A$4:$F$500,4)","v":{"$error":"#N/A"}},{"$f":"VLOOKUP(B17,Emp_Master!$A$4:$F$500,5)","v":{"$error":"#N/A"}},{"$f":"VLOOKUP(B17,Emp_Master!$A$4:$F$500,6)","v":{"$error":"#N/A"}}]
[null,null,{"$f":"VLOOKUP(B18,Emp_Master!$A$4:$F$500,2)","v":{"$error":"#N/A"}},{"$f":"VLOOKUP(B18,Emp_Master!$A$4:$F$500,3)","v":{"$error":"#N/A"}},{"$f":"VLOOKUP(B18,Emp_Master!$A$4:$F$500,4)","v":{"$error":"#N/A"}},{"$f":"VLOOKUP(B18,Emp_Master!$A$4:$F$500,5)","v":{"$error":"#N/A"}},{"$f":"VLOOKUP(B18,Emp_Master!$A$4:$F$500,6)","v":{"$error":"#N/A"}}]
[null,null,{"$f":"VLOOKUP(B19,Emp_Master!$A$4:$F$500,2)","v":{"$error":"#N/A"}},{"$f":"VLOOKUP(B19,Emp_Master!$A$4:$F$500,3)","v":{"$error":"#N/A"}},{"$f":"VLOOKUP(B19,Emp_Master!$A$4:$F$500,4)","v":{"$error":"#N/A"}},{"$f":"VLOOKUP(B19,Emp_Master!$A$4:$F$500,5)","v":{"$error":"#N/A"}},{"$f":"VLOOKUP(B19,Emp_Master!$A$4:$F$500,6)","v":{"$error":"#N/A"}}]
[null,null,{"$f":"VLOOKUP(B20,Emp_Master!$A$4:$F$500,2)","v":{"$error":"#N/A"}},{"$f":"VLOOKUP(B20,Emp_Master!$A$4:$F$500,3)","v":{"$error":"#N/A"}},{"$f":"VLOOKUP(B20,Emp_Master!$A$4:$F$500,4)","v":{"$error":"#N/A"}},{"$f":"VLOOKUP(B20,Emp_Master!$A$4:$F$500,5)","v":{"$error":"#N/A"}},{"$f":"VLOOKUP(B20,Emp_Master!$A$4:$F$500,6)","v":{"$error":"#N/A"}}]
[null,null,{"$f":"VLOOKUP(B21,Emp_Master!$A$4:$F$500,2)","v":{"$error":"#N/A"}},{"$f":"VLOOKUP(B21,Emp_Master!$A$4:$F$500,3)","v":{"$error":"#N/A"}},{"$f":"VLOOKUP(B21,Emp_Master!$A$4:$F$500,4)","v":{"$error":"#N/A"}},{"$f":"VLOOKUP(B21,Emp_Master!$A$4:$F$500,5)","v":{"$error":"#N/A"}},{"$f":"VLOOKUP(B21,Emp_Master!$A$4:$F$500,6)","v":{"$error":"#N/A"}}]
[null,null,{"$f":"VLOOKUP(B22,Emp_Master!$A$4:$F$500,2)","v":{"$error":"#N/A"}},{"$f":"VLOOKUP(B22,Emp_Master!$A$4:$F$500,3)","v":{"$error":"#N/A"}},{"$f":"VLOOKUP(B22,Emp_Master!$A$4:$F$500,4)","v":{"$error":"#N/A"}},{"$f":"VLOOKUP(B22,Emp_Master!$A$4:$F$500,5)","v":{"$error":"#N/A"}},{"$f":"VLOOKUP(B22,Emp_Master!$A$4:$F$500,6)","v":{"$error":"#N/A"}}]
[null,null,{"$f":"VLOOKUP(B23,Emp_Master!$A$4:$F$500,2)","v":{"$error":"#N/A"}},{"$f":"VLOOKUP(B23,Emp_Master!$A$4:$F$500,3)","v":{"$error":"#N/A"}},{"$f":"VLOOKUP(B23,Emp_Master!$A$4:$F$500,4)","v":{"$error":"#N/A"}},{"$f":"VLOOKUP(B23,Emp_Master!$A$4:$F$500,5)","v":{"$error":"#N/A"}},{"$f":"VLOOKUP(B23,Emp_Master!$A$4:$F$500,6)","v":{"$error":"#N/A"}}]
[null,null,{"$f":"VLOOKUP(B24,Emp_Master!$A$4:$F$500,2)","v":{"$error":"#N/A"}},{"$f":"VLOOKUP(B24,Emp_Master!$A$4:$F$500,3)","v":{"$error":"#N/A"}},{"$f":"VLOOKUP(B24,Emp_Master!$A$4:$F$500,4)","v":{"$error":"#N/A"}},{"$f":"VLOOKUP(B24,Emp_Master!$A$4:$F$500,5)","v":{"$error":"#N/A"}},{"$f":"VLOOKUP(B24,Emp_Master!$A$4:$F$500,6)","v":{"$error":"#N/A"}}]
[null,null,{"$f":"VLOOKUP(B25,Emp_Master!$A$4:$F$500,2)","v":{"$error":"#N/A"}},{"$f":"VLOOKUP(B25,Emp_Master!$A$4:$F$500,3)","v":{"$error":"#N/A"}},{"$f":"VLOOKUP(B25,Emp_Master!$A$4:$F$500,4)","v":{"$error":"#N/A"}},{"$f":"VLOOKUP(B25,Emp_Master!$A$4:$F$500,5)","v":{"$error":"#N/A"}},{"$f":"VLOOKUP(B25,Emp_Master!$A$4:$F$500,6)","v":{"$error":"#N/A"}}]
[null,null,{"$f":"VLOOKUP(B26,Emp_Master!$A$4:$F$500,2)","v":{"$error":"#N/A"}},{"$f":"VLOOKUP(B26,Emp_Master!$A$4:$F$500,3)","v":{"$error":"#N/A"}},{"$f":"VLOOKUP(B26,Emp_Master!$A$4:$F$500,4)","v":{"$error":"#N/A"}},{"$f":"VLOOKUP(B26,Emp_Master!$A$4:$F$500,5)","v":{"$error":"#N/A"}},{"$f":"VLOOKUP(B26,Emp_Master!$A$4:$F$500,6)","v":{"$error":"#N/A"}}]
[null,null,{"$f":"VLOOKUP(B27,Emp_Master!$A$4:$F$500,2)","v":{"$error":"#N/A"}},{"$f":"VLOOKUP(B27,Emp_Master!$A$4:$F$500,3)","v":{"$error":"#N/A"}},{"$f":"VLOOKUP(B27,Emp_Master!$A$4:$F$500,4)","v":{"$error":"#N/A"}},{"$f":"VLOOKUP(B27,Emp_Master!$A$4:$F$500,5)","v":{"$error":"#N/A"}},{"$f":"VLOOKUP(B27,Emp_Master!$A$4:$F$500,6)","v":{"$error":"#N/A"}}]
[null,null,{"$f":"VLOOKUP(B28,Emp_Master!$A$4:$F$500,2)","v":{"$error":"#N/A"}},{"$f":"VLOOKUP(B28,Emp_Master!$A$4:$F$500,3)","v":{"$error":"#N/A"}},{"$f":"VLOOKUP(B28,Emp_Master!$A$4:$F$500,4)","v":{"$error":"#N/A"}},{"$f":"VLOOKUP(B28,Emp_Master!$A$4:$F$500,5)","v":{"$error":"#N/A"}},{"$f":"VLOOKUP(B28,Emp_Master!$A$4:$F$500,6)","v":{"$error":"#N/A"}}]
[null,null,{"$f":"VLOOKUP(B29,Emp_Master!$A$4:$F$500,2)","v":{"$error":"#N/A"}},{"$f":"VLOOKUP(B29,Emp_Master!$A$4:$F$500,3)","v":{"$error":"#N/A"}},{"$f":"VLOOKUP(B29,Emp_Master!$A$4:$F$500,4)","v":{"$error":"#N/A"}},{"$f":"VLOOKUP(B29,Emp_Master!$A$4:$F$500,5)","v":{"$error":"#N/A"}},{"$f":"VLOOKUP(B29,Emp_Master!$A$4:$F$500,6)","v":{"$error":"#N/A"}}]
[null,null,{"$f":"VLOOKUP(B30,Emp_Master!$A$4:$F$500,2)","v":{"$error":"#N/A"}},{"$f":"VLOOKUP(B30,Emp_Master!$A$4:$F$500,3)","v":{"$error":"#N/A"}},{"$f":"VLOOKUP(B30,Emp_Master!$A$4:$F$500,4)","v":{"$error":"#N/A"}},{"$f":"VLOOKUP(B30,Emp_Master!$A$4:$F$500,5)","v":{"$error":"#N/A"}},{"$f":"VLOOKUP(B30,Emp_Master!$A$4:$F$500,6)","v":{"$error":"#N/A"}}]
[null,null,{"$f":"VLOOKUP(B31,Emp_Master!$A$4:$F$500,2)","v":{"$error":"#N/A"}},{"$f":"VLOOKUP(B31,Emp_Master!$A$4:$F$500,3)","v":{"$error":"#N/A"}},{"$f":"VLOOKUP(B31,Emp_Master!$A$4:$F$500,4)","v":{"$error":"#N/A"}},{"$f":"VLOOKUP(B31,Emp_Master!$A$4:$F$500,5)","v":{"$error":"#N/A"}},{"$f":"VLOOKUP(B31,Emp_Master!$A$4:$F$500,6)","v":{"$error":"#N/A"}}]
[null,null,{"$f":"VLOOKUP(B32,Emp_Master!$A$4:$F$500,2)","v":{"$error":"#N/A"}},{"$f":"VLOOKUP(B32,Emp_Master!$A$4:$F$500,3)","v":{"$error":"#N/A"}},{"$f":"VLOOKUP(B32,Emp_Master!$A$4:$F$500,4)","v":{"$error":"#N/A"}},{"$f":"VLOOKUP(B32,Emp_Master!$A$4:$F$500,5)","v":{"$error":"#N/A"}},{"$f":"VLOOKUP(B32,Emp_Master!$A$4:$F$500,6)","v":{"$error":"#N/A"}}]
[null,null,{"$f":"VLOOKUP(B33,Emp_Master!$A$4:$F$500,2)","v":{"$error":"#N/A"}},{"$f":"VLOOKUP(B33,Emp_Master!$A$4:$F$500,3)","v":{"$error":"#N/A"}},{"$f":"VLOOKUP(B33,Emp_Master!$A$4:$F$500,4)","v":{"$error":"#N/A"}},{"$f":"VLOOKUP(B33,Emp_Master!$A$4:$F$500,5)","v":{"$error":"#N/A"}},{"$f":"VLOOKUP(B33,Emp_Master!$A$4:$F$500,6)","v":{"$error":"#N/A"}}]
[null,null,{"$f":"VLOOKUP(B34,Emp_Master!$A$4:$F$500,2)","v":{"$error":"#N/A"}},{"$f":"VLOOKUP(B34,Emp_Master!$A$4:$F$500,3)","v":{"$error":"#N/A"}},{"$f":"VLOOKUP(B34,Emp_Master!$A$4:$F$500,4)","v":{"$error":"#N/A"}},{"$f":"VLOOKUP(B34,Emp_Master!$A$4:$F$500,5)","v":{"$error":"#N/A"}},{"$f":"VLOOKUP(B34,Emp_Master!$A$4:$F$500,6)","v":{"$error":"#N/A"}}]
[null,null,{"$f":"VLOOKUP(B35,Emp_Master!$A$4:$F$500,2)","v":{"$error":"#N/A"}},{"$f":"VLOOKUP(B35,Emp_Master!$A$4:$F$500,3)","v":{"$error":"#N/A"}},{"$f":"VLOOKUP(B35,Emp_Master!$A$4:$F$500,4)","v":{"$error":"#N/A"}},{"$f":"VLOOKUP(B35,Emp_Master!$A$4:$F$500,5)","v":{"$error":"#N/A"}},{"$f":"VLOOKUP(B35,Emp_Master!$A$4:$F$500,6)","v":{"$error":"#N/A"}}]
[null,null,{"$f":"VLOOKUP(B36,Emp_Master!$A$4:$F$500,2)","v":{"$error":"#N/A"}},{"$f":"VLOOKUP(B36,Emp_Master!$A$4:$F$500,3)","v":{"$error":"#N/A"}},{"$f":"VLOOKUP(B36,Emp_Master!$A$4:$F$500,4)","v":{"$error":"#N/A"}},{"$f":"VLOOKUP(B36,Emp_Master!$A$4:$F$500,5)","v":{"$error":"#N/A"}},{"$f":"VLOOKUP(B36,Emp_Master!$A$4:$F$500,6)","v":{"$error":"#N/A"}}]
[null,null,{"$f":"VLOOKUP(B37,Emp_Master!$A$4:$F$500,2)","v":{"$error":"#N/A"}},{"$f":"VLOOKUP(B37,Emp_Master!$A$4:$F$500,3)","v":{"$error":"#N/A"}},{"$f":"VLOOKUP(B37,Emp_Master!$A$4:$F$500,4)","v":{"$error":"#N/A"}},{"$f":"VLOOKUP(B37,Emp_Master!$A$4:$F$500,5)","v":{"$error":"#N/A"}},{"$f":"VLOOKUP(B37,Emp_Master!$A$4:$F$500,6)","v":{"$error":"#N/A"}}]
[null,null,{"$f":"VLOOKUP(B38,Emp_Master!$A$4:$F$500,2)","v":{"$error":"#N/A"}},{"$f":"VLOOKUP(B38,Emp_Master!$A$4:$F$500,3)","v":{"$error":"#N/A"}},{"$f":"VLOOKUP(B38,Emp_Master!$A$4:$F$500,4)","v":{"$error":"#N/A"}},{"$f":"VLOOKUP(B38,Emp_Master!$A$4:$F$500,5)","v":{"$error":"#N/A"}},{"$f":"VLOOKUP(B38,Emp_Master!$A$4:$F$500,6)","v":{"$error":"#N/A"}}]
[null,null,{"$f":"VLOOKUP(B39,Emp_Master!$A$4:$F$500,2)","v":{"$error":"#N/A"}},{"$f":"VLOOKUP(B39,Emp_Master!$A$4:$F$500,3)","v":{"$error":"#N/A"}},{"$f":"VLOOKUP(B39,Emp_Master!$A$4:$F$500,4)","v":{"$error":"#N/A"}},{"$f":"VLOOKUP(B39,Emp_Master!$A$4:$F$500,5)","v":{"$error":"#N/A"}},{"$f":"VLOOKUP(B39,Emp_Master!$A$4:$F$500,6)","v":{"$error":"#N/A"}}]
[null,null,{"$f":"VLOOKUP(B40,Emp_Master!$A$4:$F$500,2)","v":{"$error":"#N/A"}},{"$f":"VLOOKUP(B40,Emp_Master!$A$4:$F$500,3)","v":{"$error":"#N/A"}},{"$f":"VLOOKUP(B40,Emp_Master!$A$4:$F$500,4)","v":{"$error":"#N/A"}},{"$f":"VLOOKUP(B40,Emp_Master!$A$4:$F$500,5)","v":{"$error":"#N/A"}},{"$f":"VLOOKUP(B40,Emp_Master!$A$4:$F$500,6)","v":{"$error":"#N/A"}}]
{"$rows_left_out":961}
{"sheet":"Repo_Emp","index":4,"n_rows":8,"n_cols":10,"rows_kept":8,"cut":false,"hidden":true,"merged":[[0,4,0,5],[3,6,4,6]]}
[{"$f":"Data_Entry!C1","v":0},null,null,null,"Summary of Agreement utilisation",null,null,null,null,"Y"]
[null,null,null,null,"Used(Nos)",{"$f":"COUNTIFS(Data_Entry!B4:B500,Repo_Emp!B6,Data_Entry!J4:J500,Repo_Emp!J1)","v":0},null,null,null,"N"]
[null,null,null,null,"In hand(Nos)",{"$f":"COUNTIFS(Data_Entry!B4:B500,Repo_Emp!B6,Data_Entry!J4:J500,Repo_Emp!J2)","v":0}]
["Employee Wise Franchise Agreeent utilisation details",null,null,null,"Total Issued(Nos)",{"$f":"+F3+F2","v":0}]
[]
["Emp_Code","(Multiple Items)","Name:",{"$f":"VLOOKUP(B6,Emp_Master!$A$4:$F$500,2)","v":{"$error":"#N/A"}},"Email id:",{"$f":"VLOOKUP(B6,Emp_Master!$A$4:$F$500,5)","v":{"$error":"#N/A"}}]
["Zone:",{"$f":"VLOOKUP(B6,Emp_Master!$A$4:$F$500,3)","v":{"$error":"#N/A"}},"Location:",{"$f":"VLOOKUP(B6,Emp_Master!$A$4:$F$500,4)","v":{"$error":"#N/A"}},"Mobile:",{"$f":"VLOOKUP(B6,Emp_Master!$A$4:$F$500,6)","v":{"$error":"#N/A"}}]
["Franchise Agr. Sr. No.","Issue Dt","Signed by Prospect ( Y / N)","Name of Prospect","Agreement Signed Dt.","Proposed Location","Business Model"]

{"sheet":"Repo_Zone","index":5,"n_rows":5,"n_cols":11,"rows_kept":5,"cut":false,"hidden":true,"merged":[[0,6,0,7],[1,9,2,10]]}
[{"$f":"Data_Entry!C1","v":0},null,null,null,null,null,"Summary of Agreement utilisation",null,null,null,"y"]
["Zone Wise Franchise Agreeent utilisation details",null,null,null,null,null,"Used(Nos)",{"$f":"COUNTIFS(Data_Entry!D4:D500,Repo_Zone!B3,Data_Entry!J4:J500,Repo_Zone!K1)","v":0}]
["Zone","(Multiple Items)",null,null,null,null,"In hand(Nos)",{"$f":"COUNTIFS(Data_Entry!D4:D500,Repo_Zone!B3,Data_Entry!J4:J500,Repo_Zone!K2)","v":0}]
["Select single zone only at a time",null,null,null,null,null,"Total Issued(Nos)",{"$f":"+H3+H2","v":0}]
["Emp_Code","Employee Name","Location","Issue Dt","Signed by Prospect ( Y / N)","Agreement Signed Dt.","Name of Prospect","Proposed Location","Business Model"]

{"sheet":"Repo_Sum","index":6,"n_rows":14,"n_cols":14,"rows_kept":14,"cut":false,"hidden":true,"merged":[[4,4,4,8],[2,2,2,9],[4,2,5,2],[4,14,5,15]]}
[null,null,{"$f":"Repo_Zone!A1","v":0}]
[null,null,null,null,null,null,"As on ",null,{"$f":"TODAY()","v":"2015-08-18"}]
[null,null,"Summary of Franchise Agreement Utilisation",null,null,null,null,null,null,null,null,null,null,"y"]
[null,null,null,null,null,null,null,null,null,null,null,null,null,"n"]
[null,null,"Zone",null,"Franchise Agreement (nos)"]
[null,null,null,null,"Utilised",null,"In hand",null,"Total"]
[null,null,"East",null,{"$f":"COUNTIFS(Data_Entry!D4:D500,Repo_Sum!C7,Data_Entry!J4:J500,Repo_Sum!N3)","v":0},null,{"$f":"COUNTIFS(Data_Entry!F4:F500,Repo_Sum!C7,Data_Entry!L4:L500,Repo_Sum!N4)","v":0},null,{"$f":"+G7+E7","v":0}]
[]
[null,null,"West",null,{"$f":"COUNTIFS(Data_Entry!D4:D500,Repo_Sum!C9,Data_Entry!J4:J500,Repo_Sum!N3)","v":0},null,{"$f":"COUNTIFS(Data_Entry!D4:D500,Repo_Sum!C9,Data_Entry!J4:J500,Repo_Sum!N4)","v":0},null,{"$f":"+G9+E9","v":0}]
[]
[null,null,"North",null,{"$f":"COUNTIFS(Data_Entry!D4:D500,Repo_Sum!C11,Data_Entry!J4:J500,Repo_Sum!N3)","v":0},null,{"$f":"COUNTIFS(Data_Entry!D4:D500,Repo_Sum!C11,Data_Entry!J4:J500,Repo_Sum!N4)","v":0},null,{"$f":"+G11+E11","v":0}]
[]
[null,null,"South",null,{"$f":"COUNTIFS(Data_Entry!D4:D500,Repo_Sum!C13,Data_Entry!J4:J500,Repo_Sum!N3)","v":0},null,{"$f":"COUNTIFS(Data_Entry!D4:D500,Repo_Sum!C13,Data_Entry!J4:J500,Repo_Sum!N4)","v":0},null,{"$f":"+G13+E13","v":0}]
[null,null,"Total",null,{"$f":"SUM(E7:E13)","v":0},null,{"$f":"SUM(G7:G13)","v":0},null,{"$f":"SUM(I7:I13)","v":0}]